Reaction Details
TargetProthrombin
LigandBDBM98169
Substrate/Competitorn/a
Meas. Tech.Inhibition Assay
IC50 74±0.0 nM
Citation Allerheiligen, SBauser, MSchirok, HRester, UHeitmeier, SGerdes, CVon Degenfeld, GDittrich-Wengenroth, ESaatmann, UStraßburger, JStraßburger, KMünter, MJLang, D Substituted oxazolidinones and their use US Patent US8487111 Publication Date 7/16/2013
 
Prothrombin
Name:Prothrombin
Type:Protein
Mol. Mass.:70029.57
Organism:Homo sapiens (Human)
Description:P00734
Residue:622
BDBM98169
NameBDBM98169
Synonyms:US8487111, 10
TypeSmall organic molecule
Emp. Form.C24H24ClN3O5S
Mol. Mass.501.982
SMILESCc1cc(ccc1-n1cccc(CCCO)c1=O)N1C[C@H](CNC(=O)c2ccc(Cl)s2)OC1=O