Reaction Details
TargetEpithelial discoidin domain-containing receptor 1
LigandBDBM104010
Substrate/Competitorn/a
Meas. Tech.EC50 Test
IC50 47.6±0.0 nM
Citation Kim, HGTan, LWeisberg, ELLiu, FCanning, PChoi, HGEzell, SAWu, HZhao, ZWang, JMandinova, AGriffin, JDBullock, ANLiu, QLee, SWGray, NS Discovery of a potent and selective DDR1 receptor tyrosine kinase inhibitor. ACS Chem Biol8:2145-50 (2013) 
 
Epithelial discoidin domain-containing receptor 1
Name:Epithelial discoidin domain-containing receptor 1
Type:Tyrosine-protein kinase
Mol. Mass.:101130.02
Organism:Homo sapiens (Human)
Description:Q08345
Residue:913
BDBM104010
NameBDBM104010
Synonyms:DDR1-IN-2
TypeSmall organic molecule
Emp. Form.C31H35F3N6O2
Mol. Mass.580.6438
SMILESCCN1CCN(Cc2ccc(cc2C(F)(F)F)C(=O)Nc2ccc(C)c(NCc3cnc4[nH]ccc4c3OC)c2)CC1