Reaction Details
TargetHIV-1 protease
LigandBDBM104107
Substrate/Competitorn/a
Meas. Tech.Inhibition Assay
Ki 0.146±0.071 nM
Citation Shen, YAltman, MDAli, ANalam, MNCao, HRana, TMSchiffer, CATidor, B Testing the substrate-envelope hypothesis with designed pairs of compounds. ACS Chem Biol8:2433-41 (2013) 
 
HIV-1 protease
Name:HIV-1 protease
Synonyms:HIV-1 protease wild type
Type:Protein
Mol. Mass.:10757.68
Organism:Human immunodeficiency virus
Description:O90785
Residue:99
BDBM104107
NameBDBM104107
Synonyms:(2S,3S)-2-(Acetylamino)-N-[(1S,2R)-2-hydroxy-3-[[(4-methoxyphenyl)sulfonyl](2- methylpropyl)amino]-1-(phenylmethyl)propyl]-3-methyl-pentanamide (AF-68)
TypeSmall organic molecule
Emp. Form.C29H43N3O6S
Mol. Mass.561.733
SMILESCC[C@H](C)[C@H](NC(C)=O)C(=O)N[C@@H](Cc1ccccc1)[C@H](O)CN(CC(C)C)S(=O)(=O)c1ccc(OC)cc1