Reaction Details
TargetGag-Pol polyprotein [484-582,I497V,V499I,E519D,G532V,I538V,R541K,D544E,Q553K,V566A,L573M]
LigandBDBM104105
Substrate/Competitorn/a
Meas. Tech.Inhibition Assay
Ki 18.20±8.12 nM
Citation Shen, YAltman, MDAli, ANalam, MNCao, HRana, TMSchiffer, CATidor, B Testing the substrate-envelope hypothesis with designed pairs of compounds. ACS Chem Biol8:2433-41 (2013) 
 
Gag-Pol polyprotein [484-582,I497V,V499I,E519D,G532V,I538V,R541K,D544E,Q553K,V566A,L573M]
Name:Gag-Pol polyprotein [484-582,I497V,V499I,E519D,G532V,I538V,R541K,D544E,Q553K,V566A,L573M]
Type:Protein
Mol. Mass.:10757.68
Organism:Human immunodeficiency virus
Description:Q9QBY3[484-582,I497V,V499I,E519D,G532V,I538V,R541K,D544E,Q553K,V566A,L573M]
Residue:99
BDBM104105
NameBDBM104105
Synonyms:3-Hydroxy-N-[(1S,2R)-2-hydroxy-3-[[[5-(5-isoxazolyl)-2-thienyl]sulfonyl][(2S)-2- methylbutyl]amino]-1-(phenylmethyl)propyl]-benzamide (AF-71)
TypeSmall organic molecule
Emp. Form.C29H33N3O6S2
Mol. Mass.583.719
SMILESCC[C@H](C)CN(C[C@@H](O)[C@H](Cc1ccccc1)NC(=O)c1cccc(O)c1)S(=O)(=O)c1ccc(s1)-c1ccno1