Reaction Details
TargetGag-Pol polyprotein [484-582,I497V,V499I,E519D,G532V,I538V,R541K,D544E,Q553K,V566A,L573M]
LigandBDBM104108
Substrate/Competitorn/a
Meas. Tech.Inhibition Assay
Ki 2.045±0.502 nM
Citation Shen, YAltman, MDAli, ANalam, MNCao, HRana, TMSchiffer, CATidor, B Testing the substrate-envelope hypothesis with designed pairs of compounds. ACS Chem Biol8:2433-41 (2013) 
 
Gag-Pol polyprotein [484-582,I497V,V499I,E519D,G532V,I538V,R541K,D544E,Q553K,V566A,L573M]
Name:Gag-Pol polyprotein [484-582,I497V,V499I,E519D,G532V,I538V,R541K,D544E,Q553K,V566A,L573M]
Type:Protein
Mol. Mass.:10757.68
Organism:Human immunodeficiency virus
Description:Q9QBY3[484-582,I497V,V499I,E519D,G532V,I538V,R541K,D544E,Q553K,V566A,L573M]
Residue:99
BDBM104108
NameBDBM104108
Synonyms:N-[(1S,2R)-3-[(Cyclohexylmethyl)[(4-methoxyphenyl)sulfonyl]amino]-2-hydroxy-1- (phenylmethyl)propyl]-3-hydroxy-benzamide (AF-77)
TypeSmall organic molecule
Emp. Form.C31H38N2O6S
Mol. Mass.566.708
SMILESCOc1ccc(cc1)S(=O)(=O)N(C[C@@H](O)[C@H](Cc1ccccc1)NC(=O)c1cccc(O)c1)CC1CCCCC1