Reaction Details
TargetGag-Pol polyprotein [484-582,I497V,V499I,E519D,R541K,D544E,Q553K,A555V,G557S,I568V,L574M,L573M]
LigandBDBM104101
Substrate/Competitorn/a
Meas. Tech.Inhibition Assay
Ki 1.713±1.042 nM
Citation Shen, YAltman, MDAli, ANalam, MNCao, HRana, TMSchiffer, CATidor, B Testing the substrate-envelope hypothesis with designed pairs of compounds. ACS Chem Biol8:2433-41 (2013) 
 
Gag-Pol polyprotein [484-582,I497V,V499I,E519D,R541K,D544E,Q553K,A555V,G557S,I568V,L574M,L573M]
Name:Gag-Pol polyprotein [484-582,I497V,V499I,E519D,R541K,D544E,Q553K,A555V,G557S,I568V,L574M,L573M]
Type:Protein
Mol. Mass.:10819.77
Organism:Human immunodeficiency virus
Description:Q9QBY3[484-582,I497V,V499I,E519D,R541K,D544E,Q553K,A555V,G557S,I568V,L574M,L573M]
Residue:99
BDBM104101
NameBDBM104101
Synonyms:MIT-2-AD-93 (AD-93)
TypeSmall organic molecule
Emp. Form.C29H33N3O5S2
Mol. Mass.567.719
SMILESCC[C@H](C)CN(C[C@@H](O)[C@H](Cc1ccccc1)NC(=O)c1cccc(O)c1)S(=O)(=O)c1ccc2ncsc2c1