Reaction Details
TargetGag-Pol polyprotein [484-582,I497V,V499I,E519D,R541K,D544E,Q553K,A555V,G557S,I568V,L574M,L573M]
LigandBDBM104103
Substrate/Competitorn/a
Meas. Tech.Inhibition Assay
Ki 2.753±0.609 nM
Citation Shen, YAltman, MDAli, ANalam, MNCao, HRana, TMSchiffer, CATidor, B Testing the substrate-envelope hypothesis with designed pairs of compounds. ACS Chem Biol8:2433-41 (2013) 
 
Gag-Pol polyprotein [484-582,I497V,V499I,E519D,R541K,D544E,Q553K,A555V,G557S,I568V,L574M,L573M]
Name:Gag-Pol polyprotein [484-582,I497V,V499I,E519D,R541K,D544E,Q553K,A555V,G557S,I568V,L574M,L573M]
Type:Protein
Mol. Mass.:10819.77
Organism:Human immunodeficiency virus
Description:Q9QBY3[484-582,I497V,V499I,E519D,R541K,D544E,Q553K,A555V,G557S,I568V,L574M,L573M]
Residue:99
BDBM104103
NameBDBM104103
Synonyms:N-[(1S,2R)-3-[(6-Benzothiazolylsulfonyl)(cyclohexylmethyl)amino]-2-hydroxy-1- (phenylmethyl)propyl]-3-hydroxy-benzamide (AF-72)
TypeSmall organic molecule
Emp. Form.C31H35N3O5S2
Mol. Mass.593.757
SMILESO[C@H](CN(CC1CCCCC1)S(=O)(=O)c1ccc2ncsc2c1)[C@H](Cc1ccccc1)NC(=O)c1cccc(O)c1