Reaction Details
TargetSerine/threonine-protein kinase pim-1
LigandBDBM104142
Substrate/Competitorn/a
Meas. Tech.PIM-1 Enzyme Assay
pH7.4±0
Temperature295.15±0 K
IC50 0.70±0.0 nM
Citation Allen, SCeleste, LLDavis, TGDeLisle, RKGreschuk, JMGross, SDHicken, EJJackson, LJKallan, NCLyssikatos, JPMarmsater, FPMunson, MCPheneger, JRast, BRobinson, JESchlachter, STTopalov, GTWright, ADZhao, Q Triazolopyridine compounds as PIM kinase inhibitors US Patent US8575145 Publication Date 11/5/2013
 
Serine/threonine-protein kinase pim-1
Name:Serine/threonine-protein kinase pim-1
Type:Protein
Mol. Mass.:35681.82
Organism:Homo sapiens (Human)
Description:P11309
Residue:313
BDBM104142
NameBDBM104142
Synonyms:US8575145, 19
TypeSmall organic molecule
Emp. Form.C21H23N5O2
Mol. Mass.377.4396
SMILESCC(C)(CO)COc1cccc2ccc(nc12)-c1nnc2cc(CN)ccn12