Reaction Details
TargetSerine/threonine-protein kinase pim-1
LigandBDBM104169
Substrate/Competitorn/a
Meas. Tech.PIM-1 Enzyme Assay
pH7.4±0
Temperature295.15±0 K
IC50 1±0.0 nM
Citation Allen, SCeleste, LLDavis, TGDeLisle, RKGreschuk, JMGross, SDHicken, EJJackson, LJKallan, NCLyssikatos, JPMarmsater, FPMunson, MCPheneger, JRast, BRobinson, JESchlachter, STTopalov, GTWright, ADZhao, Q Triazolopyridine compounds as PIM kinase inhibitors US Patent US8575145 Publication Date 11/5/2013
 
Serine/threonine-protein kinase pim-1
Name:Serine/threonine-protein kinase pim-1
Type:Protein
Mol. Mass.:35681.82
Organism:Homo sapiens (Human)
Description:P11309
Residue:313
BDBM104169
NameBDBM104169
Synonyms:US8575145, 46/47/48/49/50 US8575145, 78 US8575145, 80
TypeSmall organic molecule
Emp. Form.C21H20FN5O
Mol. Mass.377.4148
SMILESFC1CCNCCC1Oc1cccc2ccc(nc12)-c1nnc2ccccn12