Reaction Details
TargetSerine/threonine-protein kinase pim-1
LigandBDBM104186
Substrate/Competitorn/a
Meas. Tech.PIM-1 Enzyme Assay
pH7.4±0
Temperature295.15±0 K
IC50 0.65±0.0 nM
Citation Allen, SCeleste, LLDavis, TGDeLisle, RKGreschuk, JMGross, SDHicken, EJJackson, LJKallan, NCLyssikatos, JPMarmsater, FPMunson, MCPheneger, JRast, BRobinson, JESchlachter, STTopalov, GTWright, ADZhao, Q Triazolopyridine compounds as PIM kinase inhibitors US Patent US8575145 Publication Date 11/5/2013
 
Serine/threonine-protein kinase pim-1
Name:Serine/threonine-protein kinase pim-1
Type:Protein
Mol. Mass.:35681.82
Organism:Homo sapiens (Human)
Description:P11309
Residue:313
BDBM104186
NameBDBM104186
Synonyms:US8575145, 63
TypeSmall organic molecule
Emp. Form.C20H20BrN5O
Mol. Mass.426.31
SMILESCC(C)(CN)COc1cccc2ccc(nc12)-c1nnc2ccc(Br)cn12