Reaction Details
TargetALK tyrosine kinase receptor
LigandBDBM107034
Substrate/Competitorn/a
Meas. Tech.Enzyme Assay
IC50 34±n/a nM
Citation Chen, BJiang, TMarsilje, THMichellys, PNguyen, TNPei, WWu, BGao, ZGe, YHuang, CLi, YZhu, X Compounds and compositions as protein kinase inhibitors US Patent US8592432 Publication Date 11/26/2013
 
ALK tyrosine kinase receptor
Name:ALK tyrosine kinase receptor
Type:Protein
Mol. Mass.:176453.10
Organism:Homo sapiens (Human)
Description:Q9UM73
Residue:1620
BDBM107034
NameBDBM107034
Synonyms:US8592432, 8
TypeSmall organic molecule
Emp. Form.C31H37ClF2N6O4S
Mol. Mass.663.178
SMILESCC(C)Oc1cc(C2CCN(CC2)C(=O)[C@@H]2CCCN2)c(C)cc1Nc1ncc(Cl)c(Nc2ccccc2S(=O)(=O)C(F)F)n1