Reaction Details
TargetALK tyrosine kinase receptor
LigandBDBM107048
Substrate/Competitorn/a
Meas. Tech.Enzyme Assay
IC50 48±n/a nM
Citation Chen, BJiang, TMarsilje, THMichellys, PNguyen, TNPei, WWu, BGao, ZGe, YHuang, CLi, YZhu, X Compounds and compositions as protein kinase inhibitors US Patent US8592432 Publication Date 11/26/2013
 
ALK tyrosine kinase receptor
Name:ALK tyrosine kinase receptor
Type:Protein
Mol. Mass.:176453.10
Organism:Homo sapiens (Human)
Description:Q9UM73
Residue:1620
BDBM107048
NameBDBM107048
Synonyms:US8592432, 23
TypeSmall organic molecule
Emp. Form.C30H36F3N7O4S
Mol. Mass.647.712
SMILESCOc1cc(C2CCN(C[C@H](O)C(F)(F)F)CC2)c(C)cc1Nc1nc(Nc2ccccc2S(=O)(=O)C(C)C)c2c[nH]nc2n1