Reaction Details
TargetALK tyrosine kinase receptor
LigandBDBM107057
Substrate/Competitorn/a
Meas. Tech.Enzyme Assay
IC50 20±n/a nM
Citation Chen, BJiang, TMarsilje, THMichellys, PNguyen, TNPei, WWu, BGao, ZGe, YHuang, CLi, YZhu, X Compounds and compositions as protein kinase inhibitors US Patent US8592432 Publication Date 11/26/2013
 
ALK tyrosine kinase receptor
Name:ALK tyrosine kinase receptor
Type:Protein
Mol. Mass.:176453.10
Organism:Homo sapiens (Human)
Description:Q9UM73
Residue:1620
BDBM107057
NameBDBM107057
Synonyms:US8592432, 34
TypeSmall organic molecule
Emp. Form.C31H41N7O3S
Mol. Mass.591.767
SMILESCC(C)Oc1cc(C2CCN(C)CC2)c(C)cc1Nc1nc(Nc2ccccc2S(=O)(=O)C(C)C)c2c(C)[nH]nc2n1