Reaction Details
TargetALK tyrosine kinase receptor
LigandBDBM107098
Substrate/Competitorn/a
Meas. Tech.Enzyme Assay
IC50 39±n/a nM
Citation Chen, BJiang, TMarsilje, THMichellys, PNguyen, TNPei, WWu, BGao, ZGe, YHuang, CLi, YZhu, X Compounds and compositions as protein kinase inhibitors US Patent US8592432 Publication Date 11/26/2013
 
ALK tyrosine kinase receptor
Name:ALK tyrosine kinase receptor
Type:Protein
Mol. Mass.:176453.10
Organism:Homo sapiens (Human)
Description:Q9UM73
Residue:1620
BDBM107098
NameBDBM107098
Synonyms:US8592432, 84
TypeSmall organic molecule
Emp. Form.C30H40N8O3S
Mol. Mass.592.755
SMILESCCN1CCC(CC1)c1cc(OC(C)C)c(Nc2nc(Nc3ccccc3S(=O)(=O)C(C)C)c3[nH]nnc3n2)cc1C