Reaction Details
TargetAurora kinase A/Targeting protein for Xklp2 [1-43]
LigandBDBM50277545
Substrate/Competitorn/a
Meas. Tech.Inhibition Assay Protocol A
Temperature303.15±n/a K
Ki 1.86±0.0 nM
IC50 1780±345 nM
Commentsextracted
Citation Lavogina, DEnkvist, EViht, KUri, A Long residence times revealed by Aurora A kinase-targeting fluorescent probes derived from inhibitors MLN8237 and VX-689. Chembiochem15:443-50 (2014) 
 
Aurora kinase A/Targeting protein for Xklp2 [1-43]
Name:Aurora kinase A/Targeting protein for Xklp2 [1-43]
Synonyms:Aurora A/TPX2 (1-43)
Type:n/a
Mol. Mass.:n/a
Description:n/a
Components:This complex has 2 components.
Component 1
Name:Aurora kinase A
Type:Serine/threonine-protein kinase
Mol. Mass.:45830.98
Organism:Homo sapiens (Human)
Description:O14965
Residue:403
Component 2
Name:Targeting protein for Xklp2 [1-43]
Synonyms:C20orf1 DIL2 Microtubule-associated TPX2 (aa 1-43) | TPX2_HUMAN
Type:Protein
Mol. Mass.:4917.03
Organism:Homo sapiens (Human)
Description:Q9ULW0[1-43]
Residue:43
BDBM50277545
NameBDBM50277545
Synonyms:4-(9-chloro-7-(2-fluoro-6-methoxyphenyl)-5H-benzo[c]pyrimido[4,5-e]azepin-2-ylamino)-2-methoxybenzoic acid CHEMBL483158 US10092556, Example MLN8237 | US9346787, MLN8237
TypeSmall organic molecule
Emp. Form.C27H20ClFN4O4
Mol. Mass.518.924
SMILESCOc1cc(Nc2ncc3CN=C(c4cc(Cl)ccc4-c3n2)c2c(F)cccc2OC)ccc1C(O)=O