Reaction Details
TargetTransmembrane prolyl 4-hydroxylase
LigandBDBM109271
Substrate/Competitorn/a
Meas. Tech.Inhibition Assay
IC50 9e+2±n/a nM
Citation Thede, KFlamme, IOehme, FErgüden, JStoll, FWild, HKolkhof, PBeck, HJeske, M Substituted dipyridyl-dihydropyrazolones and use thereof US Patent US8609698 Publication Date 12/17/2013
 
Transmembrane prolyl 4-hydroxylase
Name:Transmembrane prolyl 4-hydroxylase
Type:Enzyme
Mol. Mass.:56654.25
Organism:Homo sapiens (Human)
Description:Q9NXG6
Residue:502
BDBM109271
NameBDBM109271
Synonyms:US8609698, 65
TypeSmall organic molecule
Emp. Form.C21H16Cl2N6O2
Mol. Mass.455.297
SMILESClc1cccc(Cl)c1NC(=O)NCc1ccnc(c1)-n1[nH]cc(-c2cccnc2)c1=O