Reaction Details
TargetCathepsin B
LigandBDBM110192
Substrate/Competitorn/a
Meas. Tech.Cathepsin B Inhibition Assay
pH5.5±n/a
Temperature310.15±n/a K
IC50 4.947e+4± 164 nM
Commentsextracted
Citation Baek, KHKarki, RLee, ESNa, YKwon, Y Synthesis and investigation of dihydroxychalcones as calpain and cathepsin inhibitors. Bioorg Chem51:24-30 (2013) 
 
Cathepsin B
Name:Cathepsin B
Type:Enzyme
Mol. Mass.:37819.69
Organism:Homo sapiens (Human)
Description:gi_63102437
Residue:339
BDBM110192
NameBDBM110192
Synonyms:3-(2,4-Dihydroxyphenyl)-1-(furan-2-yl)propenone (14)
TypeSmall organic molecule
Emp. Form.C13H10O4
Mol. Mass.230.2161
SMILESOc1ccc(\C=C\C(=O)c2ccco2)c(O)c1