Reaction Details
TargetEpidermal growth factor receptor
LigandBDBM112501
Substrate/Competitorn/a
Meas. Tech.ELISA-Based Kinase Assay
pH7.4±n/a
Temperature298.15±n/a K
IC50 11.35±0 nM
Commentsextracted
Citation Fakhoury, SALee, HTReed, JESchlosser, KMSexton, KETecle, HWinters, RT 4-phenylamino-quinazolin-6-yl-amides US Patent US8623883 Publication Date 1/7/2014
 
Epidermal growth factor receptor
Name:Epidermal growth factor receptor
Type:Receptor Kinase Domain
Mol. Mass.:134279.59
Organism:Homo sapiens (Human)
Description:P00533
Residue:1210
BDBM112501
NameBDBM112501
Synonyms:US8623883, No. 7
TypeSmall organic molecule
Emp. Form.C30H36ClFN6O3
Mol. Mass.583.097
SMILESFc1ccc(Nc2ncnc3cc(OCCCN4CCOCC4)c(NC(=O)\C=C\CN4CCCCC4)cc23)cc1Cl