Reaction Details
TargetEpidermal growth factor receptor
LigandBDBM112503
Substrate/Competitorn/a
Meas. Tech.ELISA-Based Kinase Assay
pH7.4±n/a
Temperature298.15±n/a K
IC50 18.08±0 nM
Commentsextracted
Citation Fakhoury, SALee, HTReed, JESchlosser, KMSexton, KETecle, HWinters, RT 4-phenylamino-quinazolin-6-yl-amides US Patent US8623883 Publication Date 1/7/2014
 
Epidermal growth factor receptor
Name:Epidermal growth factor receptor
Type:Receptor Kinase Domain
Mol. Mass.:134279.59
Organism:Homo sapiens (Human)
Description:P00533
Residue:1210
BDBM112503
NameBDBM112503
Synonyms:US8623883, No. 9
TypeSmall organic molecule
Emp. Form.C24H24ClF2N5O2
Mol. Mass.487.929
SMILESCOc1cc2ncnc(Nc3ccc(F)c(Cl)c3)c2cc1NC(=O)\C=C\CN1CCC(F)CC1