Reaction Details
TargetReceptor tyrosine-protein kinase erbB-2
LigandBDBM112501
Substrate/Competitorn/a
Meas. Tech.ELISA-Based Kinase Assay
pH7.4±n/a
Temperature298.15±n/a K
IC50 84.05±0 nM
Commentsextracted
Citation Fakhoury, SALee, HTReed, JESchlosser, KMSexton, KETecle, HWinters, RT 4-phenylamino-quinazolin-6-yl-amides US Patent US8623883 Publication Date 1/7/2014
 
Receptor tyrosine-protein kinase erbB-2
Name:Receptor tyrosine-protein kinase erbB-2
Type:n/a
Mol. Mass.:137894.47
Organism:Homo sapiens (Human)
Description:P04626
Residue:1255
BDBM112501
NameBDBM112501
Synonyms:US8623883, No. 7
TypeSmall organic molecule
Emp. Form.C30H36ClFN6O3
Mol. Mass.583.097
SMILESFc1ccc(Nc2ncnc3cc(OCCCN4CCOCC4)c(NC(=O)\C=C\CN4CCCCC4)cc23)cc1Cl