Reaction Details
TargetReceptor tyrosine-protein kinase erbB-4
LigandBDBM112501
Substrate/Competitorn/a
Meas. Tech.ELISA-Based Kinase Assay
pH7.4±n/a
Temperature298.15±n/a K
IC50 61.5±0 nM
Commentsextracted
Citation Fakhoury, SALee, HTReed, JESchlosser, KMSexton, KETecle, HWinters, RT 4-phenylamino-quinazolin-6-yl-amides US Patent US8623883 Publication Date 1/7/2014
 
Receptor tyrosine-protein kinase erbB-4
Name:Receptor tyrosine-protein kinase erbB-4
Type:Protein
Mol. Mass.:146803.56
Organism:Homo sapiens (Human)
Description:Q15303
Residue:1308
BDBM112501
NameBDBM112501
Synonyms:US8623883, No. 7
TypeSmall organic molecule
Emp. Form.C30H36ClFN6O3
Mol. Mass.583.097
SMILESFc1ccc(Nc2ncnc3cc(OCCCN4CCOCC4)c(NC(=O)\C=C\CN4CCCCC4)cc23)cc1Cl