Reaction Details
TargetPhosphatidylinositol 4,5-bisphosphate 3-kinase catalytic subunit alpha isoform
LigandBDBM50433043
Substrate/Competitorn/a
Meas. Tech.Biochemical Assay
pH7.4±n/a
Temperature298.15±n/a K
IC50 3.62±n/a nM
Citation Cheng, HBhumralkar, DDress, KRHoffman, JEJohnson, MCKania, RSLe, PTNambu, MDPairish, MAPlewe, MBTran, KT 4-methylpyridopyrimidinone compounds US Patent US8633204 Publication Date 1/21/2014
 
Phosphatidylinositol 4,5-bisphosphate 3-kinase catalytic subunit alpha isoform
Name:Phosphatidylinositol 4,5-bisphosphate 3-kinase catalytic subunit alpha isoform
Type:Enzyme Subunit
Mol. Mass.:124294.87
Organism:Homo sapiens (Human)
Description:P42336
Residue:1068
BDBM50433043
NameBDBM50433043
Synonyms:CHEMBL2375961 | US8633204, 307
TypeSmall organic molecule
Emp. Form.C21H25N7O4
Mol. Mass.439.4677
SMILESCOc1ncc(cn1)-c1cc2c(C)nc(N)nc2n([C@@H]2CC[C@@H](CC2)OCC(N)=O)c1=O