Reaction Details
TargetRibosomal protein S6 kinase beta-1
LigandBDBM116507
Substrate/Competitorn/a
Meas. Tech.Enzyme Assay
pH7.5±n/a
Temperature298.15±n/a K
IC50 0.39±n/a nM
Commentsextracted
Citation Sutton, AELan, RRichardson, TEPerrey, DVandeveer, HGHuck, BRKarra, SRChen, XXiao, YLiu-Bujalski, LGoutopoulos, AStieber, FHodous, BLQiu, HJones, RHeasley, BH Amino azaheterocyclic carboxamides US Patent US8637532 Publication Date 1/28/2014
 
Ribosomal protein S6 kinase beta-1
Name:Ribosomal protein S6 kinase beta-1
Type:Enzyme
Mol. Mass.:59139.89
Organism:Homo sapiens (Human)
Description:His-tagged S6K1.
Residue:525
BDBM116507
NameBDBM116507
Synonyms:US8637532, 188
TypeSmall organic molecule
Emp. Form.C18H19N5O2
Mol. Mass.337.3758
SMILESCOc1cc(C(N)=O)c2ncnc(N[C@H](CN)c3ccccc3)c2c1