Reaction Details
TargetAurora kinase A
LigandBDBM116390
Substrate/Competitorn/a
Meas. Tech.Enzyme Assay
IC50 0.11±n/a nM
Citation Sutton, AELan, RRichardson, TEPerrey, DVandeveer, HGHuck, BRKarra, SRChen, XXiao, YLiu-Bujalski, LGoutopoulos, AStieber, FHodous, BLQiu, HJones, RHeasley, BH Amino azaheterocyclic carboxamides US Patent US8637532 Publication Date 1/28/2014
 
Aurora kinase A
Name:Aurora kinase A
Type:Serine/threonine-protein kinase
Mol. Mass.:45830.98
Organism:Homo sapiens (Human)
Description:O14965
Residue:403
BDBM116390
NameBDBM116390
Synonyms:US8637532, 71
TypeSmall organic molecule
Emp. Form.C25H24N6O2
Mol. Mass.440.4971
SMILESCN(C)c1ccc(cc1)C(=O)Nc1cccc(CNc2ncnc3c(cccc23)C(N)=O)c1