Reaction Details
TargetAurora kinase A
LigandBDBM116672
Substrate/Competitorn/a
Meas. Tech.Enzyme Assay
IC50 0.12±n/a nM
Citation Sutton, AELan, RRichardson, TEPerrey, DVandeveer, HGHuck, BRKarra, SRChen, XXiao, YLiu-Bujalski, LGoutopoulos, AStieber, FHodous, BLQiu, HJones, RHeasley, BH Amino azaheterocyclic carboxamides US Patent US8637532 Publication Date 1/28/2014
 
Aurora kinase A
Name:Aurora kinase A
Type:Serine/threonine-protein kinase
Mol. Mass.:45830.98
Organism:Homo sapiens (Human)
Description:O14965
Residue:403
BDBM116672
NameBDBM116672
Synonyms:US8637532, 374
TypeSmall organic molecule
Emp. Form.C26H22F2N4O3
Mol. Mass.476.4747
SMILESCOc1ccc(cc1F)C(=O)Nc1cc(ccc1F)[C@@H](C)Nc1nccc2c(cccc12)C(N)=O