Reaction Details
TargetAurora kinase A
LigandBDBM116815
Substrate/Competitorn/a
Meas. Tech.Enzyme Assay
IC50 0.16±n/a nM
Citation Sutton, AELan, RRichardson, TEPerrey, DVandeveer, HGHuck, BRKarra, SRChen, XXiao, YLiu-Bujalski, LGoutopoulos, AStieber, FHodous, BLQiu, HJones, RHeasley, BH Amino azaheterocyclic carboxamides US Patent US8637532 Publication Date 1/28/2014
 
Aurora kinase A
Name:Aurora kinase A
Type:Serine/threonine-protein kinase
Mol. Mass.:45830.98
Organism:Homo sapiens (Human)
Description:O14965
Residue:403
BDBM116815
NameBDBM116815
Synonyms:US8637532, 541
TypeSmall organic molecule
Emp. Form.C22H20N6O3S
Mol. Mass.448.498
SMILESCCOC(=O)c1cnc(Nc2cccc(CNc3ncnc4c(cccc34)C(N)=O)c2)s1