Reaction Details
TargetAurora kinase A
LigandBDBM116931
Substrate/Competitorn/a
Meas. Tech.Enzyme Assay
IC50 0.06±n/a nM
Citation Sutton, AELan, RRichardson, TEPerrey, DVandeveer, HGHuck, BRKarra, SRChen, XXiao, YLiu-Bujalski, LGoutopoulos, AStieber, FHodous, BLQiu, HJones, RHeasley, BH Amino azaheterocyclic carboxamides US Patent US8637532 Publication Date 1/28/2014
 
Aurora kinase A
Name:Aurora kinase A
Type:Serine/threonine-protein kinase
Mol. Mass.:45830.98
Organism:Homo sapiens (Human)
Description:O14965
Residue:403
BDBM116931
NameBDBM116931
Synonyms:US8637532, 658
TypeSmall organic molecule
Emp. Form.C24H17F2N5O4
Mol. Mass.477.4197
SMILESNC(=O)c1cccc2c(NCc3cccc(NC(=O)c4ccc5OC(F)(F)Oc5c4)c3)ncnc12