Reaction Details
TargetTGF-beta receptor type-1
LigandBDBM282850
Substrate/Competitorn/a
Meas. Tech.Biological Assay
pH7.4±n/a
Temperature298.15±n/a K
IC50 0.800±n/a nM
Commentsextracted
Citation Kinsella, TGelman, MHong, HDarwish, ISSingh, RYu, JBorzilleri, RMVelaparthi, ULiu, PDarne, CRahaman, HWarrier, JS TGF-beta inhibitors US Patent US9884868 Publication Date 2/6/2018
 
TGF-beta receptor type-1
Name:TGF-beta receptor type-1
Type:enzyme
Mol. Mass.:55968.24
Organism:Homo sapiens (Human)
Description:P36897
Residue:503
BDBM282850
NameBDBM282850
Synonyms:6-(4-(3-chloro-4-fluorophenyl)-1-(2,2-difluoropropyl)- 1H-imidazol-5-yl)imidazo[1,2-b]pyridazine-3- carbonitrile US11352360, Example 56' | US9884868, Example 56'
TypeSmall organic molecule
Emp. Form.C19H12ClF3N6
Mol. Mass.416.787
SMILESCC(F)(F)Cn1cnc(c1-c1ccc2ncc(C#N)n2n1)-c1ccc(F)c(Cl)c1