Reaction Details
TargetTGF-beta receptor type-1
LigandBDBM282911
Substrate/Competitorn/a
Meas. Tech.Biological Assay
pH7.4±n/a
Temperature298.15±n/a K
IC50 0.900±n/a nM
Commentsextracted
Citation Kinsella, TGelman, MHong, HDarwish, ISSingh, RYu, JBorzilleri, RMVelaparthi, ULiu, PDarne, CRahaman, HWarrier, JS TGF-beta inhibitors US Patent US9884868 Publication Date 2/6/2018
 
TGF-beta receptor type-1
Name:TGF-beta receptor type-1
Type:enzyme
Mol. Mass.:55968.24
Organism:Homo sapiens (Human)
Description:P36897
Residue:503
BDBM282911
NameBDBM282911
Synonyms:6-(4-(3-chloro-4-fluorophenyl)-1-isopropyl-1H- imidazol-5-yl)imidazo[1,2-b]pyridazine-3-carboxamide US11352360, Example 116' | US9884868, Example 116'
TypeSmall organic molecule
Emp. Form.C19H16ClFN6O
Mol. Mass.398.821
SMILESCC(C)n1cnc(c1-c1ccc2ncc(C(N)=O)n2n1)-c1ccc(F)c(Cl)c1