Reaction Details
TargetTGF-beta receptor type-1
LigandBDBM283030
Substrate/Competitorn/a
Meas. Tech.Biological Assay
pH7.4±n/a
Temperature298.15±n/a K
IC50 0.600±n/a nM
Commentsextracted
Citation Kinsella, TGelman, MHong, HDarwish, ISSingh, RYu, JBorzilleri, RMVelaparthi, ULiu, PDarne, CRahaman, HWarrier, JS TGF-beta inhibitors US Patent US9884868 Publication Date 2/6/2018
 
TGF-beta receptor type-1
Name:TGF-beta receptor type-1
Type:enzyme
Mol. Mass.:55968.24
Organism:Homo sapiens (Human)
Description:P36897
Residue:503
BDBM283030
NameBDBM283030
Synonyms:6-(4-(3-chloro-4-fluorophenyl)-1-(2,2-difluoroethyl)- 1H-imidazol-5-yl)imidazo[1,2-a]pyridine-3- carboxamide US11352360, Example 231' | US9884868, Example 231'
TypeSmall organic molecule
Emp. Form.C19H13ClF3N5O
Mol. Mass.419.788
SMILESNC(=O)c1cnc2ccc(cn12)-c1c(ncn1CC(F)F)-c1ccc(F)c(Cl)c1