Reaction Details
TargetTGF-beta receptor type-1
LigandBDBM283066
Substrate/Competitorn/a
Meas. Tech.Biological Assay
pH7.4±n/a
Temperature298.15±n/a K
IC50 0.300±n/a nM
Commentsextracted
Citation Kinsella, TGelman, MHong, HDarwish, ISSingh, RYu, JBorzilleri, RMVelaparthi, ULiu, PDarne, CRahaman, HWarrier, JS TGF-beta inhibitors US Patent US9884868 Publication Date 2/6/2018
 
TGF-beta receptor type-1
Name:TGF-beta receptor type-1
Type:enzyme
Mol. Mass.:55968.24
Organism:Homo sapiens (Human)
Description:P36897
Residue:503
BDBM283066
NameBDBM283066
Synonyms:6-(1-(1-cyanocyclopropyl)-4-(4-fluorophenyl)-1H- imidazol-5-yl)imidazo[1,2-b]pyridazine-3-carbonitrile US11352360, Example 267' | US9884868, Example 267'
TypeSmall organic molecule
Emp. Form.C20H12FN7
Mol. Mass.369.3546
SMILESFc1ccc(cc1)-c1ncn(c1-c1ccc2ncc(C#N)n2n1)C1(CC1)C#N