Reaction Details
TargetCytochrome P450 3A4
LigandBDBM119129
Substrate/Competitorn/a
Meas. Tech.Spectral Binding Titrations
pH7.4±n/a
Kd 1.6e+2± 1e+1 nM
Commentsextracted
Citation Sevrioukova, IFPoulos, TL Dissecting cytochrome P450 3A4-ligand interactions using ritonavir analogues. Biochemistry52:4474-81 (2013) 
 
Cytochrome P450 3A4
Name:Cytochrome P450 3A4
Type:Enzyme
Mol. Mass.:57349.57
Organism:Homo sapiens (Human)
Description:n/a
Residue:503
BDBM119129
NameBDBM119129
Synonyms:GS8
TypeSmall organic molecule
Emp. Form.C28H35N3O3S
Mol. Mass.493.661
SMILESCC[C@H](C)C(=O)N[C@H](CC[C@H](Cc1ccccc1)NC(=O)OCc1cncs1)Cc1ccccc1