Reaction Details
TargetPlasma kallikrein
LigandBDBM283463
Substrate/Competitorn/a
Meas. Tech.In Vitro Enzyme Inhibition of hPK
pH7.5±n/a
IC50<100±n/a nM
Commentsextracted
Citation McDonald, AQian, S Therapeutic inhibitory compounds US Patent US10023557 Publication Date 7/17/2018
 
Plasma kallikrein
Name:Plasma kallikrein
Type:Protein
Mol. Mass.:71391.16
Organism:Homo sapiens (Human)
Description:P03952
Residue:638
BDBM283463
NameBDBM283463
Synonyms:N-((1-aminoisoquinolin-6-yl)methyl)-2-((6- methylquinolin-3-yl)methyl)isonicotinamide US10266515, Example 115 US11021463, Example 115 | US9611252, Example 115
TypeSmall organic molecule
Emp. Form.C27H23N5O
Mol. Mass.433.5044
SMILESCc1ccc2ncc(Cc3cc(ccn3)C(=O)NCc3ccc4c(N)nccc4c3)cc2c1