Reaction Details
TargetPlasma kallikrein
LigandBDBM283363
Substrate/Competitorn/a
Meas. Tech.In Vitro Contact Cellular Assay
EC50<100±n/a nM
Citation McDonald, AQian, S Therapeutic inhibitory compounds US Patent US10023557 Publication Date 7/17/2018
 
Plasma kallikrein
Name:Plasma kallikrein
Type:Protein
Mol. Mass.:71391.16
Organism:Homo sapiens (Human)
Description:P03952
Residue:638
BDBM283363
NameBDBM283363
Synonyms:N-((6-amino-2,4-dimethylpyridin-3-yl)methyl)- 2-((3-methyl-8-(methylsulfonyl)quinolin-6- yl)methyl)isonicotinamide US10266515, Example 15 US11021463, Example 15 | US9611252, Example 15
TypeSmall organic molecule
Emp. Form.C26H27N5O3S
Mol. Mass.489.589
SMILESCc1cnc2c(cc(Cc3cc(ccn3)C(=O)NCc3c(C)cc(N)nc3C)cc2c1)S(C)(=O)=O