Reaction Details
TargetPlasma kallikrein
LigandBDBM283382
Substrate/Competitorn/a
Meas. Tech.In Vitro Contact Cellular Assay
EC50<100±n/a nM
Citation McDonald, AQian, S Therapeutic inhibitory compounds US Patent US10023557 Publication Date 7/17/2018
 
Plasma kallikrein
Name:Plasma kallikrein
Type:Protein
Mol. Mass.:71391.16
Organism:Homo sapiens (Human)
Description:P03952
Residue:638
BDBM283382
NameBDBM283382
Synonyms:N-((6-amino-2-methylpyridin-3-yl)methyl)-2- ((3-chloroquinolin-6-yl)methyl)isonicotinamide US10266515, Example 39 US11021463, Example 39 | US9611252, Example 39
TypeSmall organic molecule
Emp. Form.C23H20ClN5O
Mol. Mass.417.891
SMILESCc1nc(N)ccc1CNC(=O)c1ccnc(Cc2ccc3ncc(Cl)cc3c2)c1