Reaction Details
TargetPlasma kallikrein
LigandBDBM283398
Substrate/Competitorn/a
Meas. Tech.In Vitro Contact Cellular Assay
EC50<100±n/a nM
Citation McDonald, AQian, S Therapeutic inhibitory compounds US Patent US10023557 Publication Date 7/17/2018
 
Plasma kallikrein
Name:Plasma kallikrein
Type:Protein
Mol. Mass.:71391.16
Organism:Homo sapiens (Human)
Description:P03952
Residue:638
BDBM283398
NameBDBM283398
Synonyms:N-((6-amino-2,4-dimethylpyridin-3-yl)methyl)- 2-((3-chloro-8-cyanoquinolin-6- yl)methyl)isonicotinamide US10266515, Example 50 US11021463, Example 50 | US9611252, Example 50
TypeSmall organic molecule
Emp. Form.C25H21ClN6O
Mol. Mass.456.927
SMILESCc1cc(N)nc(C)c1CNC(=O)c1ccnc(Cc2cc(C#N)c3ncc(Cl)cc3c2)c1