Reaction Details
TargetPlasma kallikrein
LigandBDBM283523
Substrate/Competitorn/a
Meas. Tech.In Vitro Contact Cellular Assay
EC50<100±n/a nM
Citation McDonald, AQian, S Therapeutic inhibitory compounds US Patent US10023557 Publication Date 7/17/2018
 
Plasma kallikrein
Name:Plasma kallikrein
Type:Protein
Mol. Mass.:71391.16
Organism:Homo sapiens (Human)
Description:P03952
Residue:638
BDBM283523
NameBDBM283523
Synonyms:N-((6-(aminomethyl)-2,4-dimethylpyridin-3- yl)methyl)-2-((3-(trifluoromethyl)quinolin-6- yl)methyl)isonicotinamide US10308637, Example 172
TypeSmall organic molecule
Emp. Form.C26H24F3N5O
Mol. Mass.479.4969
SMILESCc1cc(CN)nc(C)c1CNC(=O)c1ccnc(Cc2ccc3ncc(cc3c2)C(F)(F)F)c1