Reaction Details
TargetReceptor-type tyrosine-protein kinase FLT3
LigandBDBM50399540
Substrate/Competitorn/a
Meas. Tech.HTRF kinase assay
pH7±n/a
Temperature298.15±n/a K
IC50 5.61±0.0 nM
Commentsextracted
Citation Zhou, SRen, JLiu, MRen, LLiu, YGong, P Design, synthesis and pharmacological evaluation of 6,7-disubstituted-4-phenoxyquinoline derivatives as potential antitumor agents. Bioorg Chem57:30-42 (2014) 
 
Receptor-type tyrosine-protein kinase FLT3
Name:Receptor-type tyrosine-protein kinase FLT3
Type:Enzyme
Mol. Mass.:112888.62
Organism:Homo sapiens (Human)
Description:P36888
Residue:993
BDBM50399540
NameBDBM50399540
Synonyms:FORETINIB US10882853, Compound For-Oxide
TypeSmall organic molecule
Emp. Form.C34H34F2N4O6
Mol. Mass.632.6538
SMILESCOc1cc2c(Oc3ccc(NC(=O)C4(CC4)C(=O)Nc4ccc(F)cc4)cc3F)ccnc2cc1OCCCN1CCOCC1