Reaction Details
TargetHistone deacetylase 8
LigandBDBM120967
Substrate/Competitorn/a
Meas. Tech.Fluorometric Assay
IC50 720±n/a nM
Citation Guo, LTang, GWang, ZWong, JCZhang, W N-hydroxy-benzamids for the treatment of cancer US Patent US8716285 Publication Date 5/6/2014
 
Histone deacetylase 8
Name:Histone deacetylase 8
Type:Enzyme
Mol. Mass.:41749.60
Organism:Homo sapiens (Human)
Description:Q9BY41
Residue:377
BDBM120967
NameBDBM120967
Synonyms:US8716285, 24
TypeSmall organic molecule
Emp. Form.C20H19N5O2
Mol. Mass.361.3972
SMILESONC(=O)c1ccc2CCC(Cc2c1)Nc1nccc(n1)-c1cccnc1