Reaction Details
TargetHistone deacetylase 8
LigandBDBM120983
Substrate/Competitorn/a
Meas. Tech.Fluorometric Assay
IC50 350±n/a nM
Citation Guo, LTang, GWang, ZWong, JCZhang, W N-hydroxy-benzamids for the treatment of cancer US Patent US8716285 Publication Date 5/6/2014
 
Histone deacetylase 8
Name:Histone deacetylase 8
Type:Enzyme
Mol. Mass.:41749.60
Organism:Homo sapiens (Human)
Description:Q9BY41
Residue:377
BDBM120983
NameBDBM120983
Synonyms:US8716285, 40
TypeSmall organic molecule
Emp. Form.C17H17FN2O4S
Mol. Mass.364.391
SMILESONC(=O)c1ccc2CCC(Cc2c1)NS(=O)(=O)c1cccc(F)c1