Reaction Details
TargetXanthine dehydrogenase/oxidase
LigandBDBM121537
Substrate/Competitorn/a
Meas. Tech.Inhibition Activity
IC50 6.7±n/a nM
Citation Song, JUKim, GTChoi, SPJung, CKPark, DSChoi, ESKim, THPark, HJPark, WSPark, HSKoo, KCArtemov, V Compounds effective as xanthine oxidase inhibitors, method for preparing the same, and pharmaceutical composition containing the same US Patent US8729273 Publication Date 5/20/2014
 
Xanthine dehydrogenase/oxidase
Name:Xanthine dehydrogenase/oxidase
Type:Protein
Mol. Mass.:146809.00
Organism:Bos taurus (Bovine)
Description:P80457
Residue:1332
BDBM121537
NameBDBM121537
Synonyms:US8729273, 7
TypeSmall organic molecule
Emp. Form.C17H16N4O2
Mol. Mass.308.3345
SMILESCCC(C)n1cc(C#N)c2cc(ccc12)-n1cc(cn1)C(O)=O