Reaction Details
TargetXanthine dehydrogenase/oxidase
LigandBDBM121540
Substrate/Competitorn/a
Meas. Tech.Inhibition Activity
IC50 5.2±n/a nM
Citation Song, JUKim, GTChoi, SPJung, CKPark, DSChoi, ESKim, THPark, HJPark, WSPark, HSKoo, KCArtemov, V Compounds effective as xanthine oxidase inhibitors, method for preparing the same, and pharmaceutical composition containing the same US Patent US8729273 Publication Date 5/20/2014
 
Xanthine dehydrogenase/oxidase
Name:Xanthine dehydrogenase/oxidase
Type:Protein
Mol. Mass.:146809.00
Organism:Bos taurus (Bovine)
Description:P80457
Residue:1332
BDBM121540
NameBDBM121540
Synonyms:US8729273, 10
TypeSmall organic molecule
Emp. Form.C16H13FN4O2
Mol. Mass.312.2984
SMILESCC(CF)n1cc(C#N)c2cc(ccc12)-n1cc(cn1)C(O)=O