Reaction Details
TargetXanthine dehydrogenase/oxidase
LigandBDBM121542
Substrate/Competitorn/a
Meas. Tech.Inhibition Activity
IC50 11.6±n/a nM
Citation Song, JUKim, GTChoi, SPJung, CKPark, DSChoi, ESKim, THPark, HJPark, WSPark, HSKoo, KCArtemov, V Compounds effective as xanthine oxidase inhibitors, method for preparing the same, and pharmaceutical composition containing the same US Patent US8729273 Publication Date 5/20/2014
 
Xanthine dehydrogenase/oxidase
Name:Xanthine dehydrogenase/oxidase
Type:Protein
Mol. Mass.:146809.00
Organism:Bos taurus (Bovine)
Description:P80457
Residue:1332
BDBM121542
NameBDBM121542
Synonyms:US8729273, 12
TypeSmall organic molecule
Emp. Form.C17H16N4O2
Mol. Mass.308.3345
SMILESCC(C)n1cc(C#N)c2cc(ccc12)-n1cc(C(O)=O)c(C)n1