Reaction Details
TargetXanthine dehydrogenase/oxidase
LigandBDBM121548
Substrate/Competitorn/a
Meas. Tech.Inhibition Activity
IC50 13±n/a nM
Citation Song, JUKim, GTChoi, SPJung, CKPark, DSChoi, ESKim, THPark, HJPark, WSPark, HSKoo, KCArtemov, V Compounds effective as xanthine oxidase inhibitors, method for preparing the same, and pharmaceutical composition containing the same US Patent US8729273 Publication Date 5/20/2014
 
Xanthine dehydrogenase/oxidase
Name:Xanthine dehydrogenase/oxidase
Type:Protein
Mol. Mass.:146809.00
Organism:Bos taurus (Bovine)
Description:P80457
Residue:1332
BDBM121548
NameBDBM121548
Synonyms:US8729273, 18
TypeSmall organic molecule
Emp. Form.C15H13N5O2
Mol. Mass.295.296
SMILESCC(C)n1cc(C#N)c2cc(ccc12)-n1cnc(n1)C(O)=O