Reaction Details
TargetXanthine dehydrogenase/oxidase
LigandBDBM121553
Substrate/Competitorn/a
Meas. Tech.Inhibition Activity
IC50 10±n/a nM
Citation Song, JUKim, GTChoi, SPJung, CKPark, DSChoi, ESKim, THPark, HJPark, WSPark, HSKoo, KCArtemov, V Compounds effective as xanthine oxidase inhibitors, method for preparing the same, and pharmaceutical composition containing the same US Patent US8729273 Publication Date 5/20/2014
 
Xanthine dehydrogenase/oxidase
Name:Xanthine dehydrogenase/oxidase
Type:Protein
Mol. Mass.:146809.00
Organism:Bos taurus (Bovine)
Description:P80457
Residue:1332
BDBM121553
NameBDBM121553
Synonyms:US8729273, 23
TypeSmall organic molecule
Emp. Form.C19H15N3O3
Mol. Mass.333.3407
SMILESOC(=O)c1ccnc(c1)-c1ccc2n(cc(C#N)c2c1)C1CCOC1