Reaction Details
TargetTrace amine-associated receptor 1
LigandBDBM122301
Substrate/Competitorn/a
Meas. Tech.Binding assay
Temperature277.15±n/a K
Ki 0.2±n/a nM
Commentsextracted
Citation Galley, GGoergler, AGroebke Zbinden, KNorcross, R 4,5-dihydro-oxazol-2yl derivatives US Patent US8729113 Publication Date 5/20/2014
 
Trace amine-associated receptor 1
Name:Trace amine-associated receptor 1
Type:Protein
Mol. Mass.:37635.41
Organism:Mus musculus (Mouse)
Description:Q923Y8
Residue:332
BDBM122301
NameBDBM122301
Synonyms:US8729113, 8
TypeSmall organic molecule
Emp. Form.C11H12ClFN2O2
Mol. Mass.258.677
SMILESNC1=N[C@@H](CCOc2ccc(F)c(Cl)c2)CO1