Reaction Details
TargetTyrosine-protein kinase BTK
LigandBDBM122423
Substrate/Competitorn/a
Meas. Tech.Inhibition Assay
pH7.2±n/a
IC50 0.24±n/a nM
Commentsextracted
Citation Billedeau, RJKondru, RKLopez-Tapia, FJLou, YOwens, TDQian, YSo, SThakkar, KCWanner, JMorales, OJ Inhibitors of bruton's tyrosine kinase US Patent US8729078 Publication Date 5/20/2014
 
Tyrosine-protein kinase BTK
Name:Tyrosine-protein kinase BTK
Type:Enzyme
Mol. Mass.:76289.95
Organism:Homo sapiens (Human)
Description:Q06187
Residue:659
BDBM122423
NameBDBM122423
Synonyms:US8729078, I-33
TypeSmall organic molecule
Emp. Form.C29H28FN7O3
Mol. Mass.541.5761
SMILESCc1ccc(Nc2nn(cc2C(N)=O)-c2cccc(c2CO)-n2ncc3cc(cc(F)c3c2=O)C(C)(C)C)nc1