Reaction Details
TargetSphingosine 1-phosphate receptor 1
LigandBDBM123452
Substrate/Competitorn/a
Meas. Tech.Binding Assay
pH7.4±n/a
Temperature277.15±n/a K
Ki 5±n/a nM
Commentsextracted
Citation Muzerelle, MQuattropani, AMontagne, CDorbais, J Oxadiazole fused heterocyclic derivatives useful for the treatment of multiple sclerosis US Patent US8741923 Publication Date 6/3/2014
 
Sphingosine 1-phosphate receptor 1
Name:Sphingosine 1-phosphate receptor 1
Type:Enzyme
Mol. Mass.:42836.02
Organism:Homo sapiens (Human)
Description:P21453
Residue:382
BDBM123452
NameBDBM123452
Synonyms:US8741923, 5
TypeSmall organic molecule
Emp. Form.C25H23N5O
Mol. Mass.409.483
SMILESCN(C)Cc1cc(ccc1-c1ccccc1C)-c1nc(no1)-c1ccc2nc[nH]c2c1