Reaction Details
TargetBeta-secretase 1
LigandBDBM123858
Substrate/Competitorn/a
Meas. Tech.Immunofluorescence Resonance Energy Transfer (FRET) Assay
pH4.5±n/a
IC50 40±n/a nM
Commentsextracted
Citation Gabellieri, EGuba, WHilpert, HMauser, HMayweg, AVRogers-Evans, MRombach, DThomas, AWoltering, TWostl, W 1,4-oxazepines as BACE1 and/or BACE2 inhibitors US Patent US8748418 Publication Date 6/10/2014
 
Beta-secretase 1
Name:Beta-secretase 1
Type:Protein
Mol. Mass.:55755.10
Organism:Homo sapiens (Human)
Description:P56817
Residue:501
BDBM123858
NameBDBM123858
Synonyms:US8748418, 2
TypeSmall organic molecule
Emp. Form.C17H18ClF4N5O
Mol. Mass.419.804
SMILESC[C@@]1(N=C(N)COC[C@@H]1F)c1cc(NCc2nn(cc2Cl)C(F)F)ccc1F