Reaction Details
TargetBeta-secretase 2
LigandBDBM123860
Substrate/Competitorn/a
Meas. Tech.Immunofluorescence Resonance Energy Transfer (FRET) Assay
pH4.5±n/a
IC50 73±n/a nM
Commentsextracted
Citation Gabellieri, EGuba, WHilpert, HMauser, HMayweg, AVRogers-Evans, MRombach, DThomas, AWoltering, TWostl, W 1,4-oxazepines as BACE1 and/or BACE2 inhibitors US Patent US8748418 Publication Date 6/10/2014
 
Beta-secretase 2
Name:Beta-secretase 2
Type:Protein
Mol. Mass.:56171.20
Organism:Homo sapiens (Human)
Description:Q9Y5Z0
Residue:518
BDBM123860
NameBDBM123860
Synonyms:US8748418, 4
TypeSmall organic molecule
Emp. Form.C17H23F2N3O2
Mol. Mass.339.3802
SMILESC[C@@]1(N=C(N)COC[C@@H]1F)c1cc(NC2CCCOC2)ccc1F